{"text_format":"1","workbook":"xlsx","n_sheets":5,"sheets":["Anleitung","Rationsberechnung","Bedarf","Futterwertabelle","Druckversion"],"not_rendered":{"charts":0,"images":0,"macros":1,"external_links":0,"defined_names":233,"comments":0,"pivot_tables":0},"unopened":[],"bounds":{"document_bytes":16777216,"sheet_cells":100000,"rows_first":2000,"rows_last":500,"rows_between":2000,"halvings":0,"cell_chars":16384,"cell_head_chars":4096},"cells_cut":0,"cells_raw":0,"read":"whole","date_system":"1900"}

{"sheet":"Anleitung","index":0,"n_rows":44,"n_cols":43,"rows_kept":44,"cut":false,"hidden":false,"merged":[[56,0,56,1],[1,0,1,4],[0,0,0,4]]}
["Futtermittelrechner für Geflügel",null,null,null,null,null,"Version 3.0"]
["©Sebastian Hilbert"]
[]
["Anleitung"]
[]
["Registerkarte \"Bedarf\""]
["In dieser Registerkarte stehen die Bedarfswerte für verschiedenes Geflügel. Da nicht alle Werte vollständig sind, "]
["sollten Sie als erstes die Badarfswerte für Ihr Futter in die eigefärbten Zellen eingeben. Wichtig ist dabei, dass Sie"]
["für alle Inhaltsstoffe, v. a. für die Aminosäuren Threonin und Tryptophan, eine Spanne einkalkulieren, damit der "]
["Solver auch eine Lösung finden kann."]
[]
["Registerkarte \"Futterwerttabelle\""]
["Hier kann der Preis für jedes Futtermittel, sowie drei weitere Futtermittel eingegeben werden."]
["Wenn Ihnen die Inhaltsstoffe für Ihr vorligendes Futtermittel bekannt ist, sollten Sie die Werte in der Tabelle ändern,"]
["denn die Angaben sind lediglich Durschnittswerte. Die Inhaltsstoffe sind in der Regel bei jeder Bezugspartie anders."]
[]
["Registerkarte \"Rationsberechnung\""]
["Alle nötigen Angaben können der farbigen Tabelle entnommen werden. Wenn Sie eine manuelle Eingabe des Prozentsatzes "]
["des jeweiligen Futtermittels wünschen, empfehle ich Ihnen die Eintragung in der Spalte C vorzunehmen, damit die Pfeile "]
["für die Änderung weiterhin funktionieren."]
{"$rows_left_out":25}
{"sheet":"Rationsberechnung","index":1,"n_rows":85,"n_cols":24,"rows_kept":85,"cut":false,"hidden":false,"merged":[[29,9,30,10],[29,11,30,12],[3,5,3,6],[2,0,3,2],[21,9,22,11],[21,12,22,13],[0,0,0,4],[3,9,7,9],[8,9,10,9],[2,9,2,11],[3,3,3,4],[2,5,2,6],[11,9,15,9],[16,9,18,9],[19,9,20,13]]}
["Rationsberechnung"]
["Bedarfswerte für:",null,null,15]
["Futtermittel",null,null,"Mindestanteil [%]","Höchstanteil [%]","Empfohlener \nHöchstanteil",null,"Kosten je kg",null,"Inhaltsstoffe bei 88% TS",null,null,"Orientierungs- werte"]
[null,null,null,"< bitte eingeben >",null,"(Orientierungswerte)",null,null,null,"Rohnährstoffe","Energie ME",{"$f":"E82/D81*880","v":{"$error":"#DIV/0!"}},{"$f":"(E84+E85)/2","v":10.899999999999999},{"$f":"IF(L4<E$84,\"!!!\",IF(L4>E$85,\"!!!\",\"OK\"))","v":{"$error":"#DIV/0!"}}]
[102,{"$f":"C5/10","v":0},0,0,100,{"$f":"HLOOKUP(Futterwertabelle!T$2,Futterwertabelle!T$2:T$126,($A5+1),FALSE)","v":"o.B."},{"$f":"IF(HLOOKUP(Futterwertabelle!U$2,Futterwertabelle!U$2:U$126,($A5+1),FALSE)=0,\" \",HLOOKUP(Futterwertabelle!U$2,Futterwertabelle!U$2:U$126,($A5+1)))","v":")* 30% Küken"},{"$f":"(HLOOKUP(Futterwertabelle!S$2,Futterwertabelle!S$2:S$126,($A5+1),FALSE))","v":0.21},null,null,"Rohasche",{"$f":"F$82/$D$81*880","v":{"$error":"#DIV/0!"}}]
[1,{"$f":"C6/10","v":0},0,0,100,{"$f":"HLOOKUP(Futterwertabelle!T$2,Futterwertabelle!T$2:T$126,($A6+1),FALSE)","v":0},{"$f":"IF(HLOOKUP(Futterwertabelle!U$2,Futterwertabelle!U$2:U$126,($A6+1),FALSE)=0,\" \",HLOOKUP(Futterwertabelle!U$2,Futterwertabelle!U$2:U$126,($A6+1)))","v":" "},{"$f":"(HLOOKUP(Futterwertabelle!S$2,Futterwertabelle!S$2:S$126,($A6+1),FALSE))","v":0},null,null,"Rohprotein",{"$f":"J$82/$D$81*880","v":{"$error":"#DIV/0!"}},{"$f":"(J84+J85)/2","v":0.1575},{"$f":"IF(L6<J$84,\"!!!\",IF(L6>J$85,\"!!!\",\"OK\"))","v":{"$error":"#DIV/0!"}}]
[1,0,0,0,100,{"$f":"HLOOKUP(Futterwertabelle!T$2,Futterwertabelle!T$2:T$126,($A7+1),FALSE)","v":0},{"$f":"IF(HLOOKUP(Futterwertabelle!U$2,Futterwertabelle!U$2:U$126,($A7+1),FALSE)=0,\" \",HLOOKUP(Futterwertabelle!U$2,Futterwertabelle!U$2:U$126,($A7+1)))","v":" "},{"$f":"(HLOOKUP(Futterwertabelle!S$2,Futterwertabelle!S$2:S$126,($A7+1),FALSE))","v":0},null,null,"Rohfett",{"$f":"K$82/$D$81*880","v":{"$error":"#DIV/0!"}}]
[1,0,0,0,100,{"$f":"HLOOKUP(Futterwertabelle!T$2,Futterwertabelle!T$2:T$126,($A8+1),FALSE)","v":0},{"$f":"IF(HLOOKUP(Futterwertabelle!U$2,Futterwertabelle!U$2:U$126,($A8+1),FALSE)=0,\" \",HLOOKUP(Futterwertabelle!U$2,Futterwertabelle!U$2:U$126,($A8+1)))","v":" "},{"$f":"(HLOOKUP(Futterwertabelle!S$2,Futterwertabelle!S$2:S$126,($A8+1),FALSE))","v":0},null,null,"Rohfaser",{"$f":"L$82/$D$81*880","v":{"$error":"#DIV/0!"}}]
[1,{"$f":"C9/10","v":0},0,0,100,{"$f":"HLOOKUP(Futterwertabelle!T$2,Futterwertabelle!T$2:T$126,($A9+1),FALSE)","v":0},{"$f":"IF(HLOOKUP(Futterwertabelle!U$2,Futterwertabelle!U$2:U$126,($A9+1),FALSE)=0,\" \",HLOOKUP(Futterwertabelle!U$2,Futterwertabelle!U$2:U$126,($A9+1)))","v":" "},{"$f":"(HLOOKUP(Futterwertabelle!S$2,Futterwertabelle!S$2:S$126,($A9+1),FALSE))","v":0},null,"Mineralstoffe","Calcium",{"$f":"M$82/$D$81*880","v":{"$error":"#DIV/0!"}},{"$f":"(M84+M85)/2","v":3.2500000000000001E-2},{"$f":"IF(L9<M$84,\"!!!\",IF(L9>M$85,\"!!!\",\"OK\"))","v":{"$error":"#DIV/0!"}}]
[1,0,0,0,100,{"$f":"HLOOKUP(Futterwertabelle!T$2,Futterwertabelle!T$2:T$126,($A10+1),FALSE)","v":0},{"$f":"IF(HLOOKUP(Futterwertabelle!U$2,Futterwertabelle!U$2:U$126,($A10+1),FALSE)=0,\" \",HLOOKUP(Futterwertabelle!U$2,Futterwertabelle!U$2:U$126,($A10+1)))","v":" "},{"$f":"(HLOOKUP(Futterwertabelle!S$2,Futterwertabelle!S$2:S$126,($A10+1),FALSE))","v":0},null,null,"Phosphor",{"$f":"N$82/$D$81*880","v":{"$error":"#DIV/0!"}},{"$f":"(N84+N85)/2","v":6.5000000000000006E-3},{"$f":"IF(L10<N$84,\"!!!\",IF(L10>N$85,\"!!!\",\"OK\"))","v":{"$error":"#DIV/0!"}}]
[1,0,0,0,100,{"$f":"HLOOKUP(Futterwertabelle!T$2,Futterwertabelle!T$2:T$126,($A11+1),FALSE)","v":0},{"$f":"IF(HLOOKUP(Futterwertabelle!U$2,Futterwertabelle!U$2:U$126,($A11+1),FALSE)=0,\" \",HLOOKUP(Futterwertabelle!U$2,Futterwertabelle!U$2:U$126,($A11+1)))","v":" "},{"$f":"(HLOOKUP(Futterwertabelle!S$2,Futterwertabelle!S$2:S$126,($A11+1),FALSE))","v":0},null,null,"Natrium",{"$f":"O$82/$D$81*880","v":{"$error":"#DIV/0!"}},{"$f":"(O84+O85)/2","v":1.8500000000000001E-3},{"$f":"IF(L11<O$84,\"!!!\",IF(L11>O$85,\"!!!\",\"OK\"))","v":{"$error":"#DIV/0!"}}]
[1,0,0,0,100,{"$f":"HLOOKUP(Futterwertabelle!T$2,Futterwertabelle!T$2:T$126,($A12+1),FALSE)","v":0},{"$f":"IF(HLOOKUP(Futterwertabelle!U$2,Futterwertabelle!U$2:U$126,($A12+1),FALSE)=0,\" \",HLOOKUP(Futterwertabelle!U$2,Futterwertabelle!U$2:U$126,($A12+1)))","v":" "},{"$f":"(HLOOKUP(Futterwertabelle!S$2,Futterwertabelle!S$2:S$126,($A12+1),FALSE))","v":0},null,"Aminosäuren","Methionin",{"$f":"P$82/$D$81*880","v":{"$error":"#DIV/0!"}},{"$f":"P84","v":3.2000000000000002E-3},{"$f":"IF(L12<P$84,\"!!!\",IF(L12>P$85,\"!!!\",\"OK\"))","v":{"$error":"#DIV/0!"}}]
[1,0,0,0,100,{"$f":"HLOOKUP(Futterwertabelle!T$2,Futterwertabelle!T$2:T$126,($A13+1),FALSE)","v":0},{"$f":"IF(HLOOKUP(Futterwertabelle!U$2,Futterwertabelle!U$2:U$126,($A13+1),FALSE)=0,\" \",HLOOKUP(Futterwertabelle!U$2,Futterwertabelle!U$2:U$126,($A13+1)))","v":" "},{"$f":"(HLOOKUP(Futterwertabelle!S$2,Futterwertabelle!S$2:S$126,($A13+1),FALSE))","v":0},null,null,"Met+Cys",{"$f":"Q$82/$D$81*880","v":{"$error":"#DIV/0!"}},{"$f":"Q84","v":6.0000000000000001E-3},{"$f":"IF(L13<Q$84,\"!!!\",IF(L13>Q$85,\"!!!\",\"OK\"))","v":{"$error":"#DIV/0!"}}]
[1,0,0,0,100,{"$f":"HLOOKUP(Futterwertabelle!T$2,Futterwertabelle!T$2:T$126,($A14+1),FALSE)","v":0},{"$f":"IF(HLOOKUP(Futterwertabelle!U$2,Futterwertabelle!U$2:U$126,($A14+1),FALSE)=0,\" \",HLOOKUP(Futterwertabelle!U$2,Futterwertabelle!U$2:U$126,($A14+1)))","v":" "},{"$f":"(HLOOKUP(Futterwertabelle!S$2,Futterwertabelle!S$2:S$126,($A14+1),FALSE))","v":0},null,null,"Lysin",{"$f":"R$82/$D$81*880","v":{"$error":"#DIV/0!"}},{"$f":"R84","v":6.4999999999999997E-3},{"$f":"IF(L14<R$84,\"!!!\",IF(L14>R$85,\"!!!\",\"OK\"))","v":{"$error":"#DIV/0!"}}]
[1,0,0,0,100,{"$f":"HLOOKUP(Futterwertabelle!T$2,Futterwertabelle!T$2:T$126,($A15+1),FALSE)","v":0},{"$f":"IF(HLOOKUP(Futterwertabelle!U$2,Futterwertabelle!U$2:U$126,($A15+1),FALSE)=0,\" \",HLOOKUP(Futterwertabelle!U$2,Futterwertabelle!U$2:U$126,($A15+1)))","v":" "},{"$f":"(HLOOKUP(Futterwertabelle!S$2,Futterwertabelle!S$2:S$126,($A15+1),FALSE))","v":0},null,null,"Thr",{"$f":"S$82/$D$81*880","v":{"$error":"#DIV/0!"}},{"$f":"S84","v":4.3E-3},{"$f":"IF(L15<S$84,\"!!!\",IF(L15>S$85,\"!!!\",\"OK\"))","v":{"$error":"#DIV/0!"}}]
[1,0,0,0,100,{"$f":"HLOOKUP(Futterwertabelle!T$2,Futterwertabelle!T$2:T$126,($A16+1),FALSE)","v":0},{"$f":"IF(HLOOKUP(Futterwertabelle!U$2,Futterwertabelle!U$2:U$126,($A16+1),FALSE)=0,\" \",HLOOKUP(Futterwertabelle!U$2,Futterwertabelle!U$2:U$126,($A16+1)))","v":" "},{"$f":"(HLOOKUP(Futterwertabelle!S$2,Futterwertabelle!S$2:S$126,($A16+1),FALSE))","v":0},null,null,"Try",{"$f":"T$82/$D$81*880","v":{"$error":"#DIV/0!"}},{"$f":"T84","v":1.4E-3},{"$f":"IF(L16<T$84,\"!!!\",IF(L16>T$85,\"!!!\",\"OK\"))","v":{"$error":"#DIV/0!"}}]
[1,0,0,0,100,{"$f":"HLOOKUP(Futterwertabelle!T$2,Futterwertabelle!T$2:T$126,($A17+1),FALSE)","v":0},{"$f":"IF(HLOOKUP(Futterwertabelle!U$2,Futterwertabelle!U$2:U$126,($A17+1),FALSE)=0,\" \",HLOOKUP(Futterwertabelle!U$2,Futterwertabelle!U$2:U$126,($A17+1)))","v":" "},{"$f":"(HLOOKUP(Futterwertabelle!S$2,Futterwertabelle!S$2:S$126,($A17+1),FALSE))","v":0},null,"Vitamine","Vitamin A",{"$f":"U82/D81*880","v":{"$error":"#DIV/0!"}},{"$f":"(U84+U85)/2","v":17800},{"$f":"IF(L17<U$84,\"!!!\",IF(L17>U$85,\"!!!\",\"OK\"))","v":{"$error":"#DIV/0!"}}]
[1,4.8828124272404251E-5,4.8828124272404249E-4,0,100,{"$f":"HLOOKUP(Futterwertabelle!T$2,Futterwertabelle!T$2:T$126,($A18+1),FALSE)","v":0},{"$f":"IF(HLOOKUP(Futterwertabelle!U$2,Futterwertabelle!U$2:U$126,($A18+1),FALSE)=0,\" \",HLOOKUP(Futterwertabelle!U$2,Futterwertabelle!U$2:U$126,($A18+1)))","v":" "},{"$f":"(HLOOKUP(Futterwertabelle!S$2,Futterwertabelle!S$2:S$126,($A18+1),FALSE))","v":0},null,null,"Vitamin D3",{"$f":"V82/D81*880","v":{"$error":"#DIV/0!"}},{"$f":"(V84+V85)/2","v":2600},{"$f":"IF(L18<V$84,\"!!!\",IF(L18>V$85,\"!!!\",\"OK\"))","v":{"$error":"#DIV/0!"}}]
[1,0,0,0,100,{"$f":"HLOOKUP(Futterwertabelle!T$2,Futterwertabelle!T$2:T$126,($A19+1),FALSE)","v":0},{"$f":"IF(HLOOKUP(Futterwertabelle!U$2,Futterwertabelle!U$2:U$126,($A19+1),FALSE)=0,\" \",HLOOKUP(Futterwertabelle!U$2,Futterwertabelle!U$2:U$126,($A19+1)))","v":" "},{"$f":"(HLOOKUP(Futterwertabelle!S$2,Futterwertabelle!S$2:S$126,($A19+1),FALSE))","v":0},null,null,"Vitamin E",{"$f":"W82/D81*880","v":{"$error":"#DIV/0!"}},{"$f":"(W84+W85)/2","v":80},{"$f":"IF(L19<W$84,\"!!!\",IF(L19>W$85,\"!!!\",\"OK\"))","v":{"$error":"#DIV/0!"}}]
[1,3.9744851728555977E-2,0.3974485172855598,0,100,{"$f":"HLOOKUP(Futterwertabelle!T$2,Futterwertabelle!T$2:T$126,($A20+1),FALSE)","v":0},{"$f":"IF(HLOOKUP(Futterwertabelle!U$2,Futterwertabelle!U$2:U$126,($A20+1),FALSE)=0,\" \",HLOOKUP(Futterwertabelle!U$2,Futterwertabelle!U$2:U$126,($A20+1)))","v":" "},{"$f":"(HLOOKUP(Futterwertabelle!S$2,Futterwertabelle!S$2:S$126,($A20+1),FALSE))","v":0}]
{"$rows_left_out":66}
{"sheet":"Bedarf","index":2,"n_rows":39,"n_cols":27,"rows_kept":39,"cut":false,"hidden":false,"merged":[]}
[]
[]
[]
[]
[]
[]
[]
[]
[]
[]
["Bezeichnung","MJ ME (Gefl.)",null,"Rohprotein (XP)",null,"Methionin",null,"Met.+Cystein",null,"Lysin","Lysin","Threonin",null,"Tryptophan",null,"Ca",null,"Phosphor",null,"Natrium",null,"Vitamin A IE/kg",null,"Vitamin D3 IE/kg ",null,"Vitamin E mg/kg"]
[null,"MJ ME","MJ ME","XP","XP","Met","Met","Met+Cys","Met+Cys","Lysin","Lysin","Thr","Thr","Trp","Trp","Ca","Ca","P","P","Na","Na","Vit A IE/kg","Vit A IE/kg","Vit D3 IE/kg ","Vit D3 IE/kg ","Vit E mg/kg","Vit E mg/kg"]
[null,"von","bis","von","bis","von","bis","von","bis","von","bis","von","bis","von ","bis","von","bis","von","bis","von","bis","von","bis","von","bis","von","bis"]
["Legehennen I",10.6,{"$f":"B14","v":10.6},0.16500000000000001,{"$f":"D14","v":0.16500000000000001},2.8E-3,{"$f":"F14","v":2.8E-3},{"$f":"(J14/100)*87","v":4.8719999999999996E-3},{"$f":"H14","v":4.8719999999999996E-3},{"$f":"F14*2","v":5.5999999999999999E-3},{"$f":"J14","v":5.5999999999999999E-3},null,null,null,null,3.5000000000000003E-2,{"$f":"P14","v":3.5000000000000003E-2},6.4999999999999997E-3,{"$f":"R14","v":6.4999999999999997E-3},1.8E-3,{"$f":"T14","v":1.8E-3},6000,{"$f":"V14","v":6000},750,{"$f":"X14","v":750},10,{"$f":"Z14","v":10}]
["Legehennen II",10,10,0.16,0.16,2.5000000000000001E-3,2.5000000000000001E-3,{"$f":"(J15/100)*87","v":4.3500000000000006E-3},4.3500000000000006E-3,{"$f":"F15*2","v":5.0000000000000001E-3},5.0000000000000001E-3,null,null,null,null,0.04,0.04,5.3E-3,5.3E-3,1.8E-3,1.8E-3,6000,6000,750,750,10,10]
["Hühnerküken (1.+2.Woche)",11.4,11.4,0.22,0.22,4.4999999999999997E-3,4.4999999999999997E-3,8.5000000000000006E-3,8.5000000000000006E-3,1.0999999999999999E-2,1.0999999999999999E-2,6.3E-3,{"$f":"L16","v":6.3E-3},1.6000000000000001E-3,{"$f":"N16","v":1.6000000000000001E-3},8.9999999999999993E-3,1.2E-2,7.0000000000000001E-3,7.0000000000000001E-3,1.1999999999999999E-3,2.5000000000000001E-3,13400,13400,750,750,60,60]
["Hühnerküken  ",11,11,0.17,0.17,3.5000000000000001E-3,3.5000000000000001E-3,{"$f":"(J17/100)*87","v":6.0900000000000008E-3},6.0900000000000008E-3,{"$f":"F17*2","v":7.0000000000000001E-3},7.0000000000000001E-3,6.3E-3,6.3E-3,1.1999999999999999E-3,{"$f":"N17","v":1.1999999999999999E-3},7.0000000000000001E-3,1.2E-2,6.4999999999999997E-3,6.4999999999999997E-3,1E-3,2.5000000000000001E-3,4000,4000,500,500,10,10]
["Junghennen",10.6,10.6,0.15,0.15,3.0000000000000001E-3,3.0000000000000001E-3,6.0000000000000001E-3,6.0000000000000001E-3,6.4999999999999997E-3,6.4999999999999997E-3,3.2000000000000002E-3,3.2000000000000002E-3,1E-3,1E-3,5.4999999999999997E-3,1.2E-2,5.4999999999999997E-3,5.4999999999999997E-3,1E-3,2.5000000000000001E-3,4000,4000,500,500,10,10]
["Legehennen",10.6,10.6,0.15,0.15,3.0000000000000001E-3,3.0000000000000001E-3,5.7999999999999996E-3,null,6.3E-3,null,4.4999999999999997E-3,null,1.5E-3]
["Zuchthennen",10.6,10.6,0.15,0.15,3.0000000000000001E-3,3.0000000000000001E-3,6.0000000000000001E-3,6.0000000000000001E-3,6.4999999999999997E-3,6.4999999999999997E-3,4.3E-3,4.3E-3,1.4E-3,1.4E-3,2.3E-2,0.04,5.0000000000000001E-3,8.0000000000000002E-3,1.1999999999999999E-3,2.5000000000000001E-3,8000,8000,1000,1000,20,20]
{"$rows_left_out":20}
{"sheet":"Futterwertabelle","index":3,"n_rows":126,"n_cols":21,"rows_kept":126,"cut":false,"hidden":false,"merged":[]}
[]
["Futtermittel","Energie MJ ME je kg","Trockensubstanz","Rohasche ","Rohprotein","Rohfett","Rohfaser","Ca","P","Na","Methionin","M+C","Lysin","Thr","Try","Vit. A","Vit. D3","Vit. E","Preis €/kg","Maximalgehalt","Küken"]
["< bitte wählen >"]
["Ackerbohne               ",10.199999999999999,870,33,259.99,14,78,1.4,4.2,0.2,1.8,5.3,16.7,9.1,2.2999999999999998,null,null,null,0.6,0.05,")* 15% Küken"]
["Backabfälle (Keks)       ",16,920,20,106,127,16,0.1,2.2999999999999998,10,1.7,3.8,2.7,3.1,1.1000000000000001,null,null,null,null,0.05]
["Baumwollextraktionsschrot",6.57,900,60.3,402,15,133,2.1,10.8,0.45,6.42,13.22,16.46,12.84,4.82,null,null,null,null,0,")* 3% Küken"]
["Bierhefe (getrocknet)",12.4,930,30,470,26,2,4,11,2,8,12.87,30,14,5.22,null,null,null,1.2050000000000001,0.08,"Futterhefe"]
["Blutmehl                 ",13.08,920,39,890,9,11,1.3,1.6,6.6,9.1999999999999993,21.7,79.599999999999994,38.5,14.2,null,null,null,null,0.05]
["Brotabfälle              ",9.1,630,16,72,20,8,0.6,1.6,6,0.8,1.7,2.2000000000000002,2.1,0.6,null,null,null,null,0.05]
["Bruchreis (Reis)",14.7,870,6.9,77,8.6999999999999993,2.8,0.5,2.1,0.09,2.11,3.91,2.52,2.54,0.96,null,null,null,0.94199999999999995,0.3]
["Citronensäure            ",0,900,800,0,0,0,0,0,0,0,0,0,0,0,null,null,null,null,"*"]
["Dicalciumphosphat",0,959,818,0,0,0,249.8,185.7,0.68,0,0,0,0,0,null,null,null,null,"*"]
["Dinkel (Korn)",12.7,870,26,118,17.2,123.6,0.5,3.7,0.02,1.75,4.6500000000000004,3.23,3.45,1.08,null,null,null,null,0.15,")* 5-10% Küken"]
["Dinkelspelzen",1,900,54.9,30.4,10.199999999999999,416.9,0.7,2,0.03,0.49,1.24,1.27,1.1399999999999999,0.25,null,null,null,null,0.05]
["Erbse                    ",11.4,870,33,209,13,59,0.8,4.2,0.2,2,5.2,15,7.8,2,null,null,null,0.28000000000000003,0.2,")* 30% Weißblühende Sorten"]
["Erdnussextraktionsschrot",9.81,890,54.3,510,16.899999999999999,65.900000000000006,1.3,6.4,0.36,5.18,12.76,16.95,13.66,4.97,null,null,null,null,0]
["Erdnusskuchen",11.72,920,43.1,508.1,71.8,60.4,1.4,6.1,0.09,5.17,12.72,16.89,13.61,4.96,null,null,null,null,0.1,")* 5% Küken"]
["Federmehl (hydrolysiert)",12.9,930,20.9,806.5,70.7,8.9,5,3.4,1,8.9700000000000006,56.67,18.41,38.159999999999997,5.5,null,null,null,null,0.03]
["Fischmehl 64%Rp          ",13.26,920,179,634.79999999999995,94.8,4.5999999999999996,28.9,22.5,11.59,18.579999999999998,24.56,46.44,26.45,6.06,null,null,null,2.2799999999999998,0.08]
["Fischmehl 70%RP          ",14.27,920,124.6,705,99.9,2.5,20.5,20,8.41,20.64,27.24,51.6,29.39,6.74,null,null,null,null,0.08]
{"$rows_left_out":107}
{"sheet":"Druckversion","index":4,"n_rows":36,"n_cols":7,"rows_kept":36,"cut":false,"hidden":false,"merged":[[1,1,1,2],[1,5,1,6]]}
[]
[null,"Lege- und Zuchthühner",null,null,null,"Lege- und Zuchthühner"]
[]
[null,"Kosten je 50 kg",{"$f":"Rationsberechnung!M22","v":{"$error":"#DIV/0!"}},null,null,"Kosten je 50 kg",{"$f":"Rationsberechnung!M22","v":{"$error":"#DIV/0!"}}]
[]
[null,"Futtermittel","Menge",null,null,"Futtermittel","Menge"]
[null,{"$f":"HLOOKUP(Futterwertabelle!A$2,Futterwertabelle!A$2:A$126,Rationsberechnung!A5+1,FALSE)","v":"Weizen                   "},{"$f":"(Rationsberechnung!B5/100)*$C$23","v":0},null,null,{"$f":"HLOOKUP(Futterwertabelle!A$2,Futterwertabelle!A$2:A$126,Rationsberechnung!A5+1,FALSE)","v":"Weizen                   "},{"$f":"(Rationsberechnung!B5/100)*$G$23","v":0}]
[null,{"$f":"HLOOKUP(Futterwertabelle!A$2,Futterwertabelle!A$2:A$126,Rationsberechnung!A6+1,FALSE)","v":"< bitte wählen >"},{"$f":"(Rationsberechnung!B6/100)*$C$23","v":0},null,null,{"$f":"HLOOKUP(Futterwertabelle!A$2,Futterwertabelle!A$2:A$126,Rationsberechnung!A6+1,FALSE)","v":"< bitte wählen >"},{"$f":"(Rationsberechnung!B6/100)*$G$23","v":0}]
[null,{"$f":"HLOOKUP(Futterwertabelle!A$2,Futterwertabelle!A$2:A$126,Rationsberechnung!A7+1,FALSE)","v":"< bitte wählen >"},{"$f":"(Rationsberechnung!B7/100)*$C$23","v":0},null,null,{"$f":"HLOOKUP(Futterwertabelle!A$2,Futterwertabelle!A$2:A$126,Rationsberechnung!A7+1,FALSE)","v":"< bitte wählen >"},{"$f":"(Rationsberechnung!B7/100)*$G$23","v":0}]
[null,{"$f":"HLOOKUP(Futterwertabelle!A$2,Futterwertabelle!A$2:A$126,Rationsberechnung!A8+1,FALSE)","v":"< bitte wählen >"},{"$f":"(Rationsberechnung!B8/100)*$C$23","v":0},null,null,{"$f":"HLOOKUP(Futterwertabelle!A$2,Futterwertabelle!A$2:A$126,Rationsberechnung!A8+1,FALSE)","v":"< bitte wählen >"},{"$f":"(Rationsberechnung!B8/100)*$G$23","v":0}]
[null,{"$f":"HLOOKUP(Futterwertabelle!A$2,Futterwertabelle!A$2:A$126,Rationsberechnung!A9+1,FALSE)","v":"< bitte wählen >"},{"$f":"(Rationsberechnung!B9/100)*$C$23","v":0},null,null,{"$f":"HLOOKUP(Futterwertabelle!A$2,Futterwertabelle!A$2:A$126,Rationsberechnung!A9+1,FALSE)","v":"< bitte wählen >"},{"$f":"(Rationsberechnung!B9/100)*$G$23","v":0}]
[null,{"$f":"HLOOKUP(Futterwertabelle!A$2,Futterwertabelle!A$2:A$126,Rationsberechnung!A10+1,FALSE)","v":"< bitte wählen >"},{"$f":"(Rationsberechnung!B10/100)*$C$23","v":0},null,null,{"$f":"HLOOKUP(Futterwertabelle!A$2,Futterwertabelle!A$2:A$126,Rationsberechnung!A10+1,FALSE)","v":"< bitte wählen >"},{"$f":"(Rationsberechnung!B10/100)*$G$23","v":0}]
[null,{"$f":"HLOOKUP(Futterwertabelle!A$2,Futterwertabelle!A$2:A$126,Rationsberechnung!A11+1,FALSE)","v":"< bitte wählen >"},{"$f":"(Rationsberechnung!B11/100)*$C$23","v":0},null,null,{"$f":"HLOOKUP(Futterwertabelle!A$2,Futterwertabelle!A$2:A$126,Rationsberechnung!A11+1,FALSE)","v":"< bitte wählen >"},{"$f":"(Rationsberechnung!B11/100)*$G$23","v":0}]
[null,{"$f":"HLOOKUP(Futterwertabelle!A$2,Futterwertabelle!A$2:A$126,Rationsberechnung!A12+1,FALSE)","v":"< bitte wählen >"},{"$f":"(Rationsberechnung!B12/100)*$C$23","v":0},null,null,{"$f":"HLOOKUP(Futterwertabelle!A$2,Futterwertabelle!A$2:A$126,Rationsberechnung!A12+1,FALSE)","v":"< bitte wählen >"},{"$f":"(Rationsberechnung!B12/100)*$G$23","v":0}]
[null,{"$f":"HLOOKUP(Futterwertabelle!A$2,Futterwertabelle!A$2:A$126,Rationsberechnung!A13+1,FALSE)","v":"< bitte wählen >"},{"$f":"(Rationsberechnung!B13/100)*$C$23","v":0},null,null,{"$f":"HLOOKUP(Futterwertabelle!A$2,Futterwertabelle!A$2:A$126,Rationsberechnung!A13+1,FALSE)","v":"< bitte wählen >"},{"$f":"(Rationsberechnung!B13/100)*$G$23","v":0}]
[null,{"$f":"HLOOKUP(Futterwertabelle!A$2,Futterwertabelle!A$2:A$126,Rationsberechnung!A14+1,FALSE)","v":"< bitte wählen >"},{"$f":"(Rationsberechnung!B14/100)*$C$23","v":0},null,null,{"$f":"HLOOKUP(Futterwertabelle!A$2,Futterwertabelle!A$2:A$126,Rationsberechnung!A14+1,FALSE)","v":"< bitte wählen >"},{"$f":"(Rationsberechnung!B14/100)*$G$23","v":0}]
[null,{"$f":"HLOOKUP(Futterwertabelle!A$2,Futterwertabelle!A$2:A$126,Rationsberechnung!A15+1,FALSE)","v":"< bitte wählen >"},{"$f":"(Rationsberechnung!B15/100)*$C$23","v":0},null,null,{"$f":"HLOOKUP(Futterwertabelle!A$2,Futterwertabelle!A$2:A$126,Rationsberechnung!A15+1,FALSE)","v":"< bitte wählen >"},{"$f":"(Rationsberechnung!B15/100)*$G$23","v":0}]
[null,{"$f":"HLOOKUP(Futterwertabelle!A$2,Futterwertabelle!A$2:A$126,Rationsberechnung!A16+1,FALSE)","v":"< bitte wählen >"},{"$f":"(Rationsberechnung!B16/100)*$C$23","v":0},null,null,{"$f":"HLOOKUP(Futterwertabelle!A$2,Futterwertabelle!A$2:A$126,Rationsberechnung!A16+1,FALSE)","v":"< bitte wählen >"},{"$f":"(Rationsberechnung!B16/100)*$G$23","v":0}]
[null,{"$f":"HLOOKUP(Futterwertabelle!A$2,Futterwertabelle!A$2:A$126,Rationsberechnung!A17+1,FALSE)","v":"< bitte wählen >"},{"$f":"(Rationsberechnung!B17/100)*$C$23","v":0},null,null,{"$f":"HLOOKUP(Futterwertabelle!A$2,Futterwertabelle!A$2:A$126,Rationsberechnung!A17+1,FALSE)","v":"< bitte wählen >"},{"$f":"(Rationsberechnung!B17/100)*$G$23","v":0}]
[null,{"$f":"HLOOKUP(Futterwertabelle!A$2,Futterwertabelle!A$2:A$126,Rationsberechnung!A18+1,FALSE)","v":"< bitte wählen >"},{"$f":"(Rationsberechnung!B18/100)*$C$23","v":1.9531249708961699E-5},null,null,{"$f":"HLOOKUP(Futterwertabelle!A$2,Futterwertabelle!A$2:A$126,Rationsberechnung!A18+1,FALSE)","v":"< bitte wählen >"},{"$f":"(Rationsberechnung!B18/100)*$G$23","v":2.4414062136202122E-5}]
{"$rows_left_out":16}